BDBM365241 US9868720, No. 112::[2-((S)-2-Methyl-pyrrolidin- 1-yl)-6-piperidin-4- yl-pyrimidin-4-yl]-(4- trifluoromethyl-pyridin- 2-yl)-amine
SMILES C[C@H]1CCCN1c1nc(Nc2cc(ccn2)C(F)(F)F)cc(n1)C1CCNCC1
InChI Key InChIKey=IOKXLKIYLUTYCV-ZDUSSCGKSA-N
Data  1 KI
  Tab Delimited (TSV)   2D SDfile   Computed 3D by Vconf -m prep SDfile
Find this compound or compounds like it in BindingDB:
Activity Spreadsheet -- Enzyme Inhibition Constant Data from BindingDB
Found 1 hit for monomerid = 365241
TargetMitogen-activated protein kinase kinase kinase 12(Homo sapiens (Human))
Genentech
US Patent
LigandPNGBDBM365241(US9868720, No. 112 | [2-((S)-2-Methyl-pyrrolidin- ...)
Affinity DataKi:  15.8nM. Assay description: DLK kinase reactions (20 μL) containing 5 nM N-terminally GST-tagged DLK (catalytic domain amino acid 1-520) (Carna Bioscience), 40 nM N-termina...
Ligand InfoPC cidPC sid
In DepthDetails US Patent