BDBM36554 3-Nitrotyrosine
SMILES NC(Cc1ccc(O)c(c1)N(=O)=O)C(O)=O
InChI Key InChIKey=FBTSQILOGYXGMD-UHFFFAOYSA-N
Data  1 KI
  Tab Delimited (TSV)   2D SDfile   Computed 3D by Vconf -m prep SDfile
Find this compound or compounds like it in BindingDB:
Activity Spreadsheet -- Enzyme Inhibition Constant Data from BindingDB
Found 1 hit for monomerid = 36554
TargetTubulin--tyrosine ligase(Homo sapiens (Human))
Binghamton University
LigandPNGBDBM36554(3-Nitrotyrosine)
Affinity DataKi:  4.00E+5nM ΔG°:  -4.82kcal/molepH: 6.8 T: 2°C. Assay description: Inhibition of [3H]-L-tyrosine incorporation into tubulin by enzyme tubulin tyrosine ligase (TTL).
In DepthDetails ArticlePubMed