BDBM365571 US9868738, Example 7
SMILES C[C@]1(Cc2ncncc2C(=N)N1)c1cc(ccc1F)-c1cncnc1
InChI Key InChIKey=HTGWWXVGZHXPDH-SFHVURJKSA-N
Data  2 KI
  Tab Delimited (TSV)   2D SDfile   Computed 3D by Vconf -m prep SDfile
Find this compound or compounds like it in BindingDB:
Activity Spreadsheet -- Enzyme Inhibition Constant Data from BindingDB
Found 2 hits for monomerid = 365571
TargetBeta-secretase 1(Homo sapiens (Human))
Merck Sharp & Dohme
US Patent
LigandPNGBDBM365571(US9868738, Example 7)
Affinity DataKi:  771nM. Assay description:  Reagents: Na+-Acetate pH 5.0; 1% Brij-35; Glycerol; Dimethyl Sulfoxide (DMSO); Recombinant human soluble BACE1 catalytic domain (>95% pure); APP ...
Ligand InfoPC cidPC sid
In DepthDetails US Patent
TargetBeta-secretase 2(Homo sapiens (Human))
Merck Sharp & Dohme
US Patent
LigandPNGBDBM365571(US9868738, Example 7)
Affinity DataKi:  3.46E+3nM. Assay description: Inhibitor IC50s at purified human autoBACE-2 are determined in a time-resolved endpoint proteolysis assay that measures hydrolysis of the QSY7-EISEVN...
Ligand InfoPC cidPC sid
In DepthDetails US Patent