BDBM365587 US9868738, Example 23
SMILES Cc1ncc2C(=N)N[C@@](C)(Cc2n1)c1cc(cs1)-c1cccc(c1)C#N
InChI Key InChIKey=SLQZIXUGMPFPMQ-FQEVSTJZSA-N
Data  2 KI
  Tab Delimited (TSV)   2D SDfile   Computed 3D by Vconf -m prep SDfile
Find this compound or compounds like it in BindingDB:
Activity Spreadsheet -- Enzyme Inhibition Constant Data from BindingDB
Found 2 hits for monomerid = 365587
TargetBeta-secretase 2(Homo sapiens (Human))
Merck Sharp & Dohme
US Patent
LigandPNGBDBM365587(US9868738, Example 23)
Affinity DataKi:  87.9nM. Assay description: Inhibitor IC50s at purified human autoBACE-2 are determined in a time-resolved endpoint proteolysis assay that measures hydrolysis of the QSY7-EISEVN...
Ligand InfoPC cidPC sid
In DepthDetails US Patent
TargetBeta-secretase 1(Homo sapiens (Human))
Merck Sharp & Dohme
US Patent
LigandPNGBDBM365587(US9868738, Example 23)
Affinity DataKi:  151nM. Assay description:  Reagents: Na+-Acetate pH 5.0; 1% Brij-35; Glycerol; Dimethyl Sulfoxide (DMSO); Recombinant human soluble BACE1 catalytic domain (>95% pure); APP ...
Ligand InfoPC cidPC sid
In DepthDetails US Patent