BDBM365934 (2S)-5-[({2,6-dimethoxy-4-[(2- methyl-3- phenylphenyl)methoxy]pheny} methyl)amino]-2- acetamidopentanoic acid::US9872852, Example 186
SMILES COc1cc(OCc2cccc(c2C)-c2ccccc2)cc(OC)c1CNCCCC[C@H](NC(C)=O)C(O)=O
InChI Key InChIKey=NYTREBUAWJPNNC-NDEPHWFRSA-N
Data  1 IC50
  Tab Delimited (TSV)   2D SDfile   Computed 3D by Vconf -m prep SDfile
Find this compound or compounds like it in BindingDB:
Activity Spreadsheet -- Enzyme Inhibition Constant Data from BindingDB
Found 1 hit for monomerid = 365934
TargetProgrammed cell death 1 ligand 1(Homo sapiens (Human))
Bristol-Myers Squibb
US Patent
LigandPNGBDBM365934((2S)-5-[({2,6-dimethoxy-4-[(2- methyl-3- phenylphe...)
Affinity DataIC50:  53nM. Assay description: All binding studies were performed in an HTRF assay buffer consisting of dPBS supplemented with 0.1% (withv) bovine serum albumin and 0.05% (v/v) Twe...
Ligand InfoKEGGPC cidPC sid
In DepthDetails US Patent