BDBM366015 2-[({2,6-dimethoxy-4- [(2-methyl-3- phenylphenyl)methoxy]phenyl} methyl)amino]-1-(pyridin-3-yl) ethan-1-ol::US9872852, Example 267
SMILES COc1cc(OCc2cccc(c2C)-c2ccccc2)cc(OC)c1CNCC(O)c1cccnc1
InChI Key InChIKey=YZWKTZFBUDURFM-UHFFFAOYSA-N
Data  1 IC50
  Tab Delimited (TSV)   2D SDfile   Computed 3D by Vconf -m prep SDfile
Find this compound or compounds like it in BindingDB:
Activity Spreadsheet -- Enzyme Inhibition Constant Data from BindingDB
Found 1 hit for monomerid = 366015
TargetProgrammed cell death 1 ligand 1(Homo sapiens (Human))
Bristol-Myers Squibb
US Patent
LigandPNGBDBM366015(2-[({2,6-dimethoxy-4- [(2-methyl-3- phenylphenyl)m...)
Affinity DataIC50:  53nM. Assay description: All binding studies were performed in an HTRF assay buffer consisting of dPBS supplemented with 0.1% (withv) bovine serum albumin and 0.05% (v/v) Twe...
Ligand InfoPC cidPC sid
In DepthDetails US Patent