BDBM366039 US9872852, Example 291::[(4-{[3-(2,3-dihydro-1,4- benzodioxin-6-yl)-2- methylphenyl]methoxy}-2,6- dimethoxyphenyl)methyl] [2-methyl-1-(4-methylpiperazin- 1-yl)propan-2-yl]amine
SMILES COc1cc(OCc2cccc(c2C)-c2ccc3OCCOc3c2)cc(OC)c1CNC(C)(C)CN1CCN(C)CC1
InChI Key InChIKey=PQZJBVBUXJOKLY-UHFFFAOYSA-N
Data  1 IC50
  Tab Delimited (TSV)   2D SDfile   Computed 3D by Vconf -m prep SDfile
Find this compound or compounds like it in BindingDB:
Activity Spreadsheet -- Enzyme Inhibition Constant Data from BindingDB
Found 1 hit for monomerid = 366039
TargetProgrammed cell death 1 ligand 1(Homo sapiens (Human))
Bristol-Myers Squibb
US Patent
LigandPNGBDBM366039(US9872852, Example 291 | [(4-{[3-(2,3-dihydro-1,4-...)
Affinity DataIC50:  53nM. Assay description: All binding studies were performed in an HTRF assay buffer consisting of dPBS supplemented with 0.1% (withv) bovine serum albumin and 0.05% (v/v) Twe...
Ligand InfoPC cidPC sid
In DepthDetails US Patent