BDBM366062 US9873683, Example 67
SMILES Fc1ccccc1CCc1nccn1-c1ccc(cc1)N1c2ccc3CCCc3c2NC(=O)CC1=O
InChI Key InChIKey=BPVIOJIDVDLBPM-UHFFFAOYSA-N
Data  1 IC50
  Tab Delimited (TSV)   2D SDfile   Computed 3D by Vconf -m prep SDfile
Find this compound or compounds like it in BindingDB:
Activity Spreadsheet -- Enzyme Inhibition Constant Data from BindingDB
Found 1 hit for monomerid = 366062
TargetP2X purinoceptor 4(Homo sapiens (Human))
Nippon Chemiphar
US Patent
LigandPNGBDBM366062(US9873683, Example 67)
Affinity DataIC50:  53nM. Assay description: The 1321N1 cells stably expressing human P2X4 receptor were seeded on a 96-well plate, cultured under the conditions of 37° C. and 5% CO2 for 24 hour...
Ligand InfoPC cidPC sid
In DepthDetails US Patent