BDBM366155 US9873693, Compound 78
SMILES COc1ccc(CNC(=O)c2cccn(Cc3ccc(F)c(F)c3)c2=O)cc1-c1c[nH]c2ncccc12
InChI Key InChIKey=BWFXDHNXCZMOMV-UHFFFAOYSA-N
Data  1 IC50
  Tab Delimited (TSV)   2D SDfile   Computed 3D by Vconf -m prep SDfile
Find this compound or compounds like it in BindingDB:
Activity Spreadsheet -- Enzyme Inhibition Constant Data from BindingDB
Found 1 hit for monomerid = 366155
Target3-phosphoinositide-dependent protein kinase 1 [51-360](Homo sapiens (Human))
Sunesis Pharmaceuticals
US Patent
LigandPNGBDBM366155(US9873693, Compound 78)
Affinity DataIC50: <500nM. Assay description: A PDK1 kinase assay was performed as follows. PDK1 (amino acids 51-360) and AKT2 (amino acids 140-467 fused to PIFtide, amino acids EEQEMFRDFDYIADW) ...
Ligand InfoPC cidPC sid
In DepthDetails US Patent