BDBM366187 US9873693, Compound 110::US9873693, Compound 270::US9873693, Compound 339
SMILES Fc1ccc(Cn2cccc(C(=O)NCCCCc3c[nH]c4ncccc34)c2=O)cc1F
InChI Key InChIKey=QBRWFYMTZNXFBJ-UHFFFAOYSA-N
Data  3 IC50
  Tab Delimited (TSV)   2D SDfile   Computed 3D by Vconf -m prep SDfile
Find this compound or compounds like it in BindingDB:
Activity Spreadsheet -- Enzyme Inhibition Constant Data from BindingDB
Found 3 hits for monomerid = 366187
Target3-phosphoinositide-dependent protein kinase 1 [51-360](Homo sapiens (Human))
Sunesis Pharmaceuticals
US Patent
LigandPNGBDBM366187(US9873693, Compound 110 | US9873693, Compound 270 ...)
Affinity DataIC50: <500nM. Assay description: A PDK1 kinase assay was performed as follows. PDK1 (amino acids 51-360) and AKT2 (amino acids 140-467 fused to PIFtide, amino acids EEQEMFRDFDYIADW) ...
Ligand InfoPC cidPC sid
In DepthDetails US Patent
Target3-phosphoinositide-dependent protein kinase 1 [51-360](Homo sapiens (Human))
Sunesis Pharmaceuticals
US Patent
LigandPNGBDBM366187(US9873693, Compound 110 | US9873693, Compound 270 ...)
Affinity DataIC50: <500nM. Assay description: A PDK1 kinase assay was performed as follows. PDK1 (amino acids 51-360) and AKT2 (amino acids 140-467 fused to PIFtide, amino acids EEQEMFRDFDYIADW) ...
Ligand InfoPC cidPC sid
In DepthDetails US Patent
Target3-phosphoinositide-dependent protein kinase 1 [51-360](Homo sapiens (Human))
Sunesis Pharmaceuticals
US Patent
LigandPNGBDBM366187(US9873693, Compound 110 | US9873693, Compound 270 ...)
Affinity DataIC50: <500nM. Assay description: A PDK1 kinase assay was performed as follows. PDK1 (amino acids 51-360) and AKT2 (amino acids 140-467 fused to PIFtide, amino acids EEQEMFRDFDYIADW) ...
Ligand InfoPC cidPC sid
In DepthDetails US Patent