BDBM366376 US9873693, Compound 306
SMILES NC(=O)C[C@@H](NC(=O)c1cccn(Cc2ccc(F)c(F)c2)c1=O)c1ncc(o1)-c1c[nH]c2ncccc12
InChI Key
Data  1 IC50
  Tab Delimited (TSV)   2D SDfile   Computed 3D by Vconf -m prep SDfile
Find this compound or compounds like it in BindingDB:
Activity Spreadsheet -- Enzyme Inhibition Constant Data from BindingDB
Found 1 hit for monomerid = 366376
Target3-phosphoinositide-dependent protein kinase 1 [51-360](Homo sapiens (Human))
Sunesis Pharmaceuticals
US Patent
LigandPNGBDBM366376(US9873693, Compound 306)
Affinity DataIC50: <500nM. Assay description: A PDK1 kinase assay was performed as follows. PDK1 (amino acids 51-360) and AKT2 (amino acids 140-467 fused to PIFtide, amino acids EEQEMFRDFDYIADW) ...
Ligand InfoPC cidPC sid
In DepthDetails US Patent