BDBM366448 4-[[8-[4- (cyanomethyl)-4- phenyl-1-piperidyl]- [1,2,4]triazolo[1,5- a]pyridin-2-yl]amino]- N-methyl-N-(1- methyl-4- piperidyl)benzamide::US9873709, Example 1-41
SMILES CN(C1CCN(C)CC1)C(=O)c1ccc(Nc2nc3c(cccn3n2)N2CCC(CC#N)(CC2)c2ccccc2)cc1
InChI Key InChIKey=AEYXDCFBNVYPGT-UHFFFAOYSA-N
Data  2 KI
  Tab Delimited (TSV)   2D SDfile   Computed 3D by Vconf -m prep SDfile
Find this compound or compounds like it in BindingDB:
Activity Spreadsheet -- Enzyme Inhibition Constant Data from BindingDB
Found 2 hits for monomerid = 366448
TargetTyrosine-protein kinase JAK2(Homo sapiens (Human))
Genentech
US Patent
LigandPNGBDBM366448(4-[[8-[4- (cyanomethyl)-4- phenyl-1-piperidyl]- [1...)
Affinity DataKi:  0.200nM. Assay description: The activity of the isolated recombinant JAK1 and JAK2 kinase domain was measured by monitoring phosphorylation of a peptide derived from JAK3 (Val-A...
Ligand InfoPC cidPC sid
In DepthDetails US Patent
TargetTyrosine-protein kinase JAK1(Homo sapiens (Human))
Genentech
US Patent
LigandPNGBDBM366448(4-[[8-[4- (cyanomethyl)-4- phenyl-1-piperidyl]- [1...)
Affinity DataKi:  2.05nM. Assay description: The activity of the isolated recombinant JAK1 and JAK2 kinase domain was measured by monitoring phosphorylation of a peptide derived from JAK3 (Val-A...
Ligand InfoPC cidPC sid
In DepthDetails US Patent