BDBM36645 CHEMBL291582::L-707,581
SMILES CCCc1nc(CC)c(C=O)n1Cc1ccc(cc1)-c1ccccc1-c1nnn[nH]1
InChI Key InChIKey=ODISHMFPJYIVHR-UHFFFAOYSA-N
Data  6 IC50
  Tab Delimited (TSV)   2D SDfile   Computed 3D by Vconf -m prep SDfile
Find this compound or compounds like it in BindingDB:
Activity Spreadsheet -- Enzyme Inhibition Constant Data from BindingDB
Found 6 hits for monomerid = 36645
TargetBeta-lactamase(Bacteroides fragilis)
Merck Research Laboratories
LigandPNGBDBM36645(CHEMBL291582 | L-707,581)
Affinity DataIC50:  7.00E+3nMpH: 7.0 T: 2°C. Assay description: Enzyme inhibition assay by biphenyl tetrazoles (BPTS)using metallo-beta-lactamase.
In DepthDetails ArticlePubMed
TargetDipeptidase 1(Homo sapiens (Human))
Merck Research Laboratories
LigandPNGBDBM36645(CHEMBL291582 | L-707,581)
Affinity DataIC50:  1.90E+5nMpH: 7.0 T: 2°C. Assay description: Enzyme inhibition assay by biphenyl tetrazoles (BPTS)using dehydropeptidase 1 (DPH-1).
In DepthDetails ArticlePubMed
LigandPNGBDBM36645(CHEMBL291582 | L-707,581)
Affinity DataIC50:  2nM. Assay description: Displacement of [125I]- Ang II from angiotensin II AT1 receptor in rat adrenal cortical microsomes
In DepthDetails Article
TargetType-2 angiotensin II receptor(RAT)
TBA
Curated by ChEMBL
LigandPNGBDBM36645(CHEMBL291582 | L-707,581)
Affinity DataIC50: >3.00E+4nM. Assay description: In vitro inhibitory activity against angiotensin II (AT2) receptor to displace 125I-Sar,Ile8-AII in rat midbrain
In DepthDetails Article
TargetType-2 angiotensin II receptor(RAT)
TBA
Curated by ChEMBL
LigandPNGBDBM36645(CHEMBL291582 | L-707,581)
Affinity DataIC50: >1.00E+4nM. Assay description: Displacement of [125I]- Ang II from angiotensin II AT2 receptor in rat adrenal cortical microsomes
In DepthDetails Article
TargetType-1 angiotensin II receptor(RABBIT)
TBA
Curated by ChEMBL
LigandPNGBDBM36645(CHEMBL291582 | L-707,581)
Affinity DataIC50:  8nM. Assay description: In vitro inhibitory activity against Angiotensin II receptor, type 1 to displace 125I-Sar,Ile8-AII in rabbit aorta
In DepthDetails Article