BDBM366916 4,4,4-trifluoro-1-[4-[2- [4-(4- morpholinopiperidine- 1-carbonyl)anilino]- [1,2,4]triazolo[1,5- a]pyridin-8-yl]-3,6- dihydro-2H-pyridin-1- yl]butan-1-one::US9873709, Example 2-210
SMILES FC(F)(F)CCC(=O)N1CCC(=CC1)c1cccn2nc(Nc3ccc(cc3)C(=O)N3CCC(CC3)N3CCOCC3)nc12
InChI Key InChIKey=XCTVSYVPUYWGIQ-UHFFFAOYSA-N
Data  2 KI
  Tab Delimited (TSV)   2D SDfile   Computed 3D by Vconf -m prep SDfile
Find this compound or compounds like it in BindingDB:
Activity Spreadsheet -- Enzyme Inhibition Constant Data from BindingDB
Found 2 hits for monomerid = 366916
TargetTyrosine-protein kinase JAK2(Homo sapiens (Human))
Genentech
US Patent
LigandPNGBDBM366916(4,4,4-trifluoro-1-[4-[2- [4-(4- morpholinopiperidi...)
Affinity DataKi:  0.290nM. Assay description: The activity of the isolated recombinant JAK1 and JAK2 kinase domain was measured by monitoring phosphorylation of a peptide derived from JAK3 (Val-A...
Ligand InfoPC cidPC sid
In DepthDetails US Patent
TargetTyrosine-protein kinase JAK1(Homo sapiens (Human))
Genentech
US Patent
LigandPNGBDBM366916(4,4,4-trifluoro-1-[4-[2- [4-(4- morpholinopiperidi...)
Affinity DataKi:  0.810nM. Assay description: The activity of the isolated recombinant JAK1 and JAK2 kinase domain was measured by monitoring phosphorylation of a peptide derived from JAK3 (Val-A...
Ligand InfoPC cidPC sid
In DepthDetails US Patent