BDBM367259 US10226464, Compound 27
SMILES Cc1cc2oc3nc(=O)[nH]c(=O)c3cc2cc1F
InChI Key InChIKey=JVKVBBJJRDFWHH-UHFFFAOYSA-N
Data  2 IC50
  Tab Delimited (TSV)   2D SDfile   Computed 3D by Vconf -m prep SDfile
Find this compound or compounds like it in BindingDB:
Activity Spreadsheet -- Enzyme Inhibition Constant Data from BindingDB
Found 2 hits for monomerid = 367259
TargetNuclear factor NF-kappa-B p105 subunit(Homo sapiens (Human))
Immunetarget
US Patent
LigandPNGBDBM367259(US10226464, Compound 27)
Affinity DataIC50: <5.00E+3nM. Assay description: NFκB/Jurkat/GFP transcriptional reporter cell line was obtained from SBI System Biosciences. NF-κB/Jurkat/GFP™ Reporter cells (5×105 cells)...
Ligand InfoPC cidPC sid
In DepthDetails US Patent
TargetNuclear factor NF-kappa-B p105 subunit(Homo sapiens (Human))
Immunetarget
US Patent
LigandPNGBDBM367259(US10226464, Compound 27)
Affinity DataIC50: <500nM. Assay description: DNA binding reaction (20 μL) was carried out in 1×DNA Binding Buffer (10 mM Tris, 40 mM NaCl, 1 mM EDTA, 4% glycerol) with 10 nM c-Rel protein a...
Ligand InfoPC cidPC sid
In DepthDetails US Patent