BDBM367468 N-4-[(6RS)-6-(Aminomethyl)-4-oxo-3-(phenylamino)-4,5,6,7-tetrahydro-1H-indol-2-yl]pyridin-2-ylacetamide::US10227299, Example 156
SMILES CC(=O)Nc1cc(ccn1)-c1[nH]c2CC(CN)CC(=O)c2c1Nc1ccccc1
InChI Key
Data  1 IC50
  Tab Delimited (TSV)   2D SDfile   Computed 3D by Vconf -m prep SDfile
Find this compound or compounds like it in BindingDB:
Activity Spreadsheet -- Enzyme Inhibition Constant Data from BindingDB
Found 1 hit for monomerid = 367468
TargetMitotic checkpoint serine/threonine-protein kinase BUB1(Homo sapiens (Human))
Bayer Pharma Aktiengesellschaft
US Patent
LigandPNGBDBM367468(N-4-[(6RS)-6-(Aminomethyl)-4-oxo-3-(phenylamino)-4...)
Affinity DataIC50:  9nM. Assay description: Bub1-inhibitory activities of compounds described in the present invention were quantified using a time-resolved fluorescence energy transfer (TR-FRE...
Ligand InfoPC cidPC sid
In DepthDetails US Patent