BDBM367668 (S)-2-amino-N-(2H-tetrazol-5-yl)pent-4-ynamide ::US10227314, Example 7
SMILES N[C@@H](CC#C)C(=O)Nc1nn[nH]n1
InChI Key
Data  1 IC50
  Tab Delimited (TSV)   2D SDfile   Computed 3D by Vconf -m prep SDfile
Find this compound or compounds like it in BindingDB:
Activity Spreadsheet -- Enzyme Inhibition Constant Data from BindingDB
Found 1 hit for monomerid = 367668
TargetCystathionine gamma-lyase(Homo sapiens (Human))
Sova Pharmaceuticals
US Patent
LigandPNGBDBM367668((S)-2-amino-N-(2H-tetrazol-5-yl)pent-4-ynamide | ...)
Affinity DataIC50:  1.25E+5nM. Assay description: Test compounds (from DMSO stock solutions) were added to (final concentrations) 20 ug/ml enzyme solution (human, mouse or rat recombinant CSE) plus 5...
In DepthDetails US Patent