BDBM368201 US10227334, Example 2-(4-((S)-2-((R)-3-fluoropyrrolidin-1-yl)propoxy)phenyl)-3-(3-hydroxyphenyl)-4- methyl-2H-chromen-6-ol
SMILES C[C@@H](COc1ccc(cc1)C1Oc2ccc(O)cc2C(C)=C1c1cccc(O)c1)N1CC[C@@H](F)C1
InChI Key InChIKey=NUQUVEAGDOYRMA-CFJHUQRDSA-N
Data  1 IC50
  Tab Delimited (TSV)   2D SDfile   Computed 3D by Vconf -m prep SDfile
Find this compound or compounds like it in BindingDB:
Activity Spreadsheet -- Enzyme Inhibition Constant Data from BindingDB
Found 1 hit for monomerid = 368201
TargetEstrogen receptor(Homo sapiens (Human))
Genentech
US Patent
LigandPNGBDBM368201(US10227334, Example 2-(4-((S)-2-((R)-3-fluoropyrro...)
Affinity DataIC50:  200nM. Assay description: MCF-7 cells were adjusted to a concentration of 40,000 cells per mL in RPMI containing 10% FBS and 20 mM HEPES. 16 microliters of the cell suspension...
Ligand InfoPC cidPC sid
In DepthDetails US Patent