BDBM368271 US10227338, Example 54
SMILES CNC1CCN(C1)c1cc(OC)ccc1Nc1ccc(cc1Cl)S(=O)(=O)Nc1cscn1
InChI Key InChIKey=LKXSBSHWWIPZAE-UHFFFAOYSA-N
Data  1 IC50
  Tab Delimited (TSV)   2D SDfile   Computed 3D by Vconf -m prep SDfile
Find this compound or compounds like it in BindingDB:
Activity Spreadsheet -- Enzyme Inhibition Constant Data from BindingDB
Found 1 hit for monomerid = 368271
TargetSodium channel protein type 9 subunit alpha(Homo sapiens (Human))
Daewoong Pharmaceutical
US Patent
LigandPNGBDBM368271(US10227338, Example 54)
Affinity DataIC50: >1.00E+3nM. Assay description: In order to measure the sodium ion channel blocking effect, an IonFlux16 Auto patch clamp system (Fluxion, Inc.) and a plate for exclusive use were u...
Ligand InfoPC cidPC sid
In DepthDetails US Patent