BDBM368402 US10227342, Example 36
SMILES COc1cc(N(C)C[C@H]2CCCN2C)c(NC(=O)C=C)cc1Nc1ncc(C(=O)OC(C)C)c(n1)-c1cn(C)c2ccccc12
InChI Key InChIKey=MILBIPKHYWBIPY-JOCHJYFZSA-N
Data  5 IC50
  Tab Delimited (TSV)   2D SDfile   Computed 3D by Vconf -m prep SDfile
Find this compound or compounds like it in BindingDB:
Activity Spreadsheet -- Enzyme Inhibition Constant Data from BindingDB
Found 5 hits for monomerid = 368402
TargetEpidermal growth factor receptor(Homo sapiens (Human))
Ariad Pharmaceuticals
US Patent
LigandPNGBDBM368402(US10227342, Example 36)
Affinity DataIC50: <100nM. Assay description: A compound's ability in selectively inhibiting EGFR exon 20 insertion mutations can be assessed using Ba/F3 cells, a murine pro-B cell line, whic...
Ligand InfoPC cidPC sid
In DepthDetails US Patent
TargetEpidermal growth factor receptor(Homo sapiens (Human))
Ariad Pharmaceuticals
US Patent
LigandPNGBDBM368402(US10227342, Example 36)
Affinity DataIC50: <100nM. Assay description: A compound's ability in selectively inhibiting EGFR exon 20 insertion mutations can be assessed using Ba/F3 cells, a murine pro-B cell line, whic...
Ligand InfoPC cidPC sid
In DepthDetails US Patent
TargetEpidermal growth factor receptor(Homo sapiens (Human))
Ariad Pharmaceuticals
US Patent
LigandPNGBDBM368402(US10227342, Example 36)
Affinity DataIC50: <100nM. Assay description: A compound's ability in selectively inhibiting Her2 exon 20 YVMA insertion mutations can be assessed using Ba/F3 cells, a murine pro-B cell line,...
Ligand InfoPC cidPC sid
In DepthDetails US Patent
TargetEpidermal growth factor receptor [T790M,L858R](Homo sapiens (Human))
Ariad Pharmaceuticals
US Patent
LigandPNGBDBM368402(US10227342, Example 36)
Affinity DataIC50: <100nM. Assay description: A compound's ability in selectively inhibiting EGFR L858R and T790M concurrent mutations can be assessed using Ba/F3 cells, a murine pro-B cell l...
Ligand InfoPC cidPC sid
In DepthDetails US Patent
TargetEpidermal growth factor receptor [T790M](Homo sapiens (Human))
Ariad Pharmaceuticals
US Patent
LigandPNGBDBM368402(US10227342, Example 36)
Affinity DataIC50: <100nM. Assay description: A compound's ability in selectively inhibiting EGFR exon 19 deletion and T790M concurrent mutations can be assessed using Ba/F3 cells, a murine p...
Ligand InfoPC cidPC sid
In DepthDetails US Patent