BDBM368424 N-(3,3- difluorocycloburyl)- 6-(1H-pyrazolo[4,3-b] pyridin-3- ylamino)naphthalene- 1-carboxamide::US10227343, Example 5
SMILES FC1(F)CC(C1)NC(=O)c1cccc2cc(Nc3n[nH]c4cccnc34)ccc12
InChI Key InChIKey=JATCXGXSAJSZJP-UHFFFAOYSA-N
Data  1 EC50
  Tab Delimited (TSV)   2D SDfile   Computed 3D by Vconf -m prep SDfile
Find this compound or compounds like it in BindingDB:
Activity Spreadsheet -- Enzyme Inhibition Constant Data from BindingDB
Found 1 hit for monomerid = 368424
TargetMetabotropic glutamate receptor 4(Homo sapiens (Human))
Vanderbilt University
US Patent
LigandPNGBDBM368424(N-(3,3- difluorocycloburyl)- 6-(1H-pyrazolo[4,3-b]...)
Affinity DataEC50:  45nM. Assay description: The disclosed compounds and compositions can be evaluated for their ability to act as a potentiator of metabotropic glutamate receptor activity, in p...
Ligand InfoPC cidPC sid
In DepthDetails US Patent