BDBM368475 N-(2- methylsulfonylethyl)- 6-(1H-pyrazolo[4,3-b] pyridin-3-ylamino) naphthalene-1- carboxamide::US10227343, Example 10
SMILES CS(=O)(=O)CCNC(=O)c1cccc2cc(Nc3n[nH]c4cccnc34)ccc12
InChI Key InChIKey=RRPXZXQVQVIDOX-UHFFFAOYSA-N
Data  1 EC50
  Tab Delimited (TSV)   2D SDfile   Computed 3D by Vconf -m prep SDfile
Find this compound or compounds like it in BindingDB:
Activity Spreadsheet -- Enzyme Inhibition Constant Data from BindingDB
Found 1 hit for monomerid = 368475
TargetMetabotropic glutamate receptor 4(Homo sapiens (Human))
Vanderbilt University
US Patent
LigandPNGBDBM368475(N-(2- methylsulfonylethyl)- 6-(1H-pyrazolo[4,3-b] ...)
Affinity DataEC50: >1.00E+4nM. Assay description: The disclosed compounds and compositions can be evaluated for their ability to act as a potentiator of metabotropic glutamate receptor activity, in p...
Ligand InfoPC cidPC sid
In DepthDetails US Patent