BDBM368484 (4-fluoro-1-piperidyl)-[6- (1H-pyrazolo[4,3-b] pyridin-3-ylamino)-1- naphthyl]methanone::US10227343, Example 19
SMILES FC1CCN(CC1)C(=O)c1cccc2cc(Nc3n[nH]c4cccnc34)ccc12
InChI Key InChIKey=XVDYWFANKGBZAN-UHFFFAOYSA-N
Data  1 EC50
  Tab Delimited (TSV)   2D SDfile   Computed 3D by Vconf -m prep SDfile
Find this compound or compounds like it in BindingDB:
Activity Spreadsheet -- Enzyme Inhibition Constant Data from BindingDB
Found 1 hit for monomerid = 368484
TargetMetabotropic glutamate receptor 4(Homo sapiens (Human))
Vanderbilt University
US Patent
LigandPNGBDBM368484((4-fluoro-1-piperidyl)-[6- (1H-pyrazolo[4,3-b] pyr...)
Affinity DataEC50:  339nM. Assay description: The disclosed compounds and compositions can be evaluated for their ability to act as a potentiator of metabotropic glutamate receptor activity, in p...
Ligand InfoPC cidPC sid
In DepthDetails US Patent