BDBM368538 N1-(2-methoxyethyl)-N1- methyl-N6-(1H-pyrazolo [4,3-b]pyridin-3-yl) isoquinoline-1,6-diamine::US10227343, Example 70
SMILES COCCN(C)c1nccc2cc(Nc3n[nH]c4cccnc34)ccc12
InChI Key InChIKey=MAHVZUYWEJIATF-UHFFFAOYSA-N
Data  1 EC50
  Tab Delimited (TSV)   2D SDfile   Computed 3D by Vconf -m prep SDfile
Find this compound or compounds like it in BindingDB:
Activity Spreadsheet -- Enzyme Inhibition Constant Data from BindingDB
Found 1 hit for monomerid = 368538
TargetMetabotropic glutamate receptor 4(Homo sapiens (Human))
Vanderbilt University
US Patent
LigandPNGBDBM368538(N1-(2-methoxyethyl)-N1- methyl-N6-(1H-pyrazolo [4,...)
Affinity DataEC50:  81nM. Assay description: The disclosed compounds and compositions can be evaluated for their ability to act as a potentiator of metabotropic glutamate receptor activity, in p...
Ligand InfoPC cidPC sid
In DepthDetails US Patent