BDBM368612 US10227350, Compound 33
SMILES Cc1nnc([nH]1)-c1cc(cc2n(c(C)nc12)-c1ccnc2c(F)ccc(F)c12)-c1ccncc1
InChI Key InChIKey=DMARIDHULCJCQC-UHFFFAOYSA-N
Data  1 IC50
  Tab Delimited (TSV)   2D SDfile   Computed 3D by Vconf -m prep SDfile
Find this compound or compounds like it in BindingDB:
Activity Spreadsheet -- Enzyme Inhibition Constant Data from BindingDB
Found 1 hit for monomerid = 368612
TargetPhosphatidylinositol 3-kinase regulatory subunit beta(Homo sapiens (Human))
Gilead Sciences
US Patent
LigandPNGBDBM368612(US10227350, Compound 33)
Affinity DataIC50:  110nM. Assay description: Class I PI3K isoforms were expressed and purified as heterodimeric recombinant proteins. All assay reagents and buffers for the TR-FRET assay were pu...
Ligand InfoPC cidPC sid
In DepthDetails US Patent