BDBM368648 US10227350, Compound 67
SMILES CC(C)c1nc2c(cc(cc2n1-c1ccnc2c(Cl)ccc(F)c12)-c1ccnc(N)c1)-c1nnc[nH]1
InChI Key InChIKey=GOVNRQVSSKTZRU-UHFFFAOYSA-N
Data  1 IC50
  Tab Delimited (TSV)   2D SDfile   Computed 3D by Vconf -m prep SDfile
Find this compound or compounds like it in BindingDB:
Activity Spreadsheet -- Enzyme Inhibition Constant Data from BindingDB
Found 1 hit for monomerid = 368648
TargetPhosphatidylinositol 3-kinase regulatory subunit beta(Homo sapiens (Human))
Gilead Sciences
US Patent
LigandPNGBDBM368648(US10227350, Compound 67)
Affinity DataIC50:  8nM. Assay description: Class I PI3K isoforms were expressed and purified as heterodimeric recombinant proteins. All assay reagents and buffers for the TR-FRET assay were pu...
Ligand InfoPC cidPC sid
In DepthDetails US Patent