BDBM369000 N-[4-[6,7-bis(2- methoxyethoxy)quinazolin-4-yl]-3- fluoro-phenyl]methanesulfonamide::US10227357, Compound P-0264
SMILES COCCOc1cc2ncnc(-c3ccc(NS(C)(=O)=O)cc3F)c2cc1OCCOC
InChI Key InChIKey=VRYBKTIGZDZKEG-UHFFFAOYSA-N
Data  2 KI
  Tab Delimited (TSV)   2D SDfile   Computed 3D by Vconf -m prep SDfile
Find this compound or compounds like it in BindingDB:
Activity Spreadsheet -- Enzyme Inhibition Constant Data from BindingDB
Found 2 hits for monomerid = 369000
TargetMast/stem cell growth factor receptor Kit [D816V](Homo sapiens (Human))
Plexxikon
US Patent
LigandPNGBDBM369000(N-[4-[6,7-bis(2- methoxyethoxy)quinazolin-4-yl]-3-...)
Affinity DataKi:  500nM. Assay description: The c-Kit mutant D816V inhibitors were assessed using an engineered BaF3-FL KIT D816V or BaF3-FL KIT V560G/D816V cell line. The BaF3-FL KIT D816V cel...
Ligand InfoPC cidPC sid
In DepthDetails US Patent
TargetMast/stem cell growth factor receptor Kit(Homo sapiens (Human))
Plexxikon
US Patent
LigandPNGBDBM369000(N-[4-[6,7-bis(2- methoxyethoxy)quinazolin-4-yl]-3-...)
Affinity DataKi:  1.05E+5nM. Assay description: The c-Kit mutant D816V inhibitors were assessed using an engineered BaF3-FL KIT D816V or BaF3-FL KIT V560G/D816V cell line. The BaF3-FL KIT D816V cel...
Ligand InfoPC cidPC sid
In DepthDetails US Patent