BDBM369432 4-(4-((2-(Bicyclo[4.2.0]octa-1(6),2,4-trien-3-yl)benzyl)oxy)phenyl)butanoic acid::US10227360, Example 26
SMILES OC(=O)CCCc1ccc(OCc2ccccc2-c2ccc3CCc3c2)cc1
InChI Key InChIKey=KKNBQRIWJRSQQI-UHFFFAOYSA-N
Data  1 EC50
  Tab Delimited (TSV)   2D SDfile   Computed 3D by Vconf -m prep SDfile
Find this compound or compounds like it in BindingDB:
Activity Spreadsheet -- Enzyme Inhibition Constant Data from BindingDB
Found 1 hit for monomerid = 369432
TargetFree fatty acid receptor 4(Homo sapiens (Human))
Piramal Enterprises
US Patent
LigandPNGBDBM369432(4-(4-((2-(Bicyclo[4.2.0]octa-1(6),2,4-trien-3-yl)b...)
Affinity DataEC50:  260nM. Assay description: Beta (β) arrestin 2 Interaction Assay (BRET assay) was performed using CHO-K1 cells stably expressing the GPR120L receptor using β-galactos...
Ligand InfoPC cidPC sid
In DepthDetails US Patent