BDBM369454 4-(4-((2-(6,7-Dihydro-4H-pyrano[4,3-d]thiazol-2-yl)-5-fluorobenzyl)oxy)phenyl)butanoic acid::US10227360, Example 48::US10227360, Example 49
SMILES OC(=O)CCCc1ccc(OCc2cc(F)ccc2-c2nc3CCOCc3s2)cc1
InChI Key InChIKey=HQJQNGBSPCUBPT-UHFFFAOYSA-N
Data  2 EC50
  Tab Delimited (TSV)   2D SDfile   Computed 3D by Vconf -m prep SDfile
Find this compound or compounds like it in BindingDB:
Activity Spreadsheet -- Enzyme Inhibition Constant Data from BindingDB
Found 2 hits for monomerid = 369454
TargetFree fatty acid receptor 4(Homo sapiens (Human))
Piramal Enterprises
US Patent
LigandPNGBDBM369454(4-(4-((2-(6,7-Dihydro-4H-pyrano[4,3-d]thiazol-2-yl...)
Affinity DataEC50:  260nM. Assay description: Beta (β) arrestin 2 Interaction Assay (BRET assay) was performed using CHO-K1 cells stably expressing the GPR120L receptor using β-galactos...
Ligand InfoPC cidPC sid
In DepthDetails US Patent
TargetFree fatty acid receptor 4(Homo sapiens (Human))
Piramal Enterprises
US Patent
LigandPNGBDBM369454(4-(4-((2-(6,7-Dihydro-4H-pyrano[4,3-d]thiazol-2-yl...)
Affinity DataEC50:  2.75E+3nM. Assay description: Beta (β) arrestin 2 Interaction Assay (BRET assay) was performed using CHO-K1 cells stably expressing the GPR120L receptor using β-galactos...
Ligand InfoPC cidPC sid
In DepthDetails US Patent