BDBM369505 2-(2-Fluoro-4-(2-(4-(((1R,2S)-2-phenylcyclopropyl)amino)piperidin-1-yl)ethoxy)phenyl)acetic acid di-hydrochloride ::US10233152, Example 43
SMILES COC(=O)Cc1ccc(OCCN2CCC(CC2)N[C@@H]2C[C@H]2c2ccccc2)cc1F
InChI Key InChIKey=VAVVRMCEAMQQQN-LADGPHEKSA-N
Data  1 IC50
  Tab Delimited (TSV)   2D SDfile   Computed 3D by Vconf -m prep SDfile
Find this compound or compounds like it in BindingDB:
Activity Spreadsheet -- Enzyme Inhibition Constant Data from BindingDB
Found 1 hit for monomerid = 369505
TargetLysine-specific histone demethylase 1A(Homo sapiens (Human))
Mirati Therapeutics
US Patent
LigandPNGBDBM369505(2-(2-Fluoro-4-(2-(4-(((1R,2S)-2-phenylcyclopropyl)...)
Affinity DataIC50:  17nM. Assay description: Briefly, compounds of the present invention were solubilized in DMSO and a series of 10, three-fold serial dilutions were made for each compound in 1...
Ligand InfoPC cidPC sid
In DepthDetails US Patent