BDBM369512 US10233152, Example 50
SMILES O=C1CCCCN1c1ccc(NCCN2CCC(CC2)N[C@@H]2C[C@H]2c2ccccc2)cc1
InChI Key InChIKey=YQHKIRWKLSCPON-IZZNHLLZSA-N
Data  1 IC50
  Tab Delimited (TSV)   2D SDfile   Computed 3D by Vconf -m prep SDfile
Find this compound or compounds like it in BindingDB:
Activity Spreadsheet -- Enzyme Inhibition Constant Data from BindingDB
Found 1 hit for monomerid = 369512
TargetLysine-specific histone demethylase 1A(Homo sapiens (Human))
Mirati Therapeutics
US Patent
LigandPNGBDBM369512(US10233152, Example 50)
Affinity DataIC50:  3nM. Assay description: Briefly, compounds of the present invention were solubilized in DMSO and a series of 10, three-fold serial dilutions were made for each compound in 1...
Ligand InfoPC cidPC sid
In DepthDetails US Patent