BDBM369531 US10233152, Example 56
SMILES O=C1CCCN1c1ccc(NCCN2CCC(CC2)N[C@@H]2C[C@H]2c2ccccc2)cc1
InChI Key InChIKey=VBPGIKQABFJECT-LOSJGSFVSA-N
Data  1 IC50
  Tab Delimited (TSV)   2D SDfile   Computed 3D by Vconf -m prep SDfile
Find this compound or compounds like it in BindingDB:
Activity Spreadsheet -- Enzyme Inhibition Constant Data from BindingDB
Found 1 hit for monomerid = 369531
TargetLysine-specific histone demethylase 1A(Homo sapiens (Human))
Mirati Therapeutics
US Patent
LigandPNGBDBM369531(US10233152, Example 56)
Affinity DataIC50:  5nM. Assay description: Briefly, compounds of the present invention were solubilized in DMSO and a series of 10, three-fold serial dilutions were made for each compound in 1...
Ligand InfoPC cidPC sid
In DepthDetails US Patent