BDBM369547 US10233152, Example 70
SMILES Cc1ccc(OCCN2CC(CN[C@@H]3C[C@H]3c3ccccc3)C2)cc1
InChI Key InChIKey=IXFWRLRHZAWBJN-FCHUYYIVSA-N
Data  1 IC50
  Tab Delimited (TSV)   2D SDfile   Computed 3D by Vconf -m prep SDfile
Find this compound or compounds like it in BindingDB:
Activity Spreadsheet -- Enzyme Inhibition Constant Data from BindingDB
Found 1 hit for monomerid = 369547
TargetLysine-specific histone demethylase 1A(Homo sapiens (Human))
Mirati Therapeutics
US Patent
LigandPNGBDBM369547(US10233152, Example 70)
Affinity DataIC50:  8nM. Assay description: Briefly, compounds of the present invention were solubilized in DMSO and a series of 10, three-fold serial dilutions were made for each compound in 1...
Ligand InfoPC cidPC sid
In DepthDetails US Patent