BDBM369591 US10233152, Example 102
SMILES C[N]1(CCOc2ccc(cc2)C(=O)NS(C)(=O)=O)CC(CN[C@@H]2C[C@H]2c2ccccc2)C1
InChI Key InChIKey=BTTVFEJXQSYJBW-XZOQPEGZSA-N
Data  1 IC50
  Tab Delimited (TSV)   2D SDfile   Computed 3D by Vconf -m prep SDfile
Find this compound or compounds like it in BindingDB:
Activity Spreadsheet -- Enzyme Inhibition Constant Data from BindingDB
Found 1 hit for monomerid = 369591
TargetLysine-specific histone demethylase 1A(Homo sapiens (Human))
Mirati Therapeutics
US Patent
LigandPNGBDBM369591(US10233152, Example 102)
Affinity DataIC50:  14nM. Assay description: Briefly, compounds of the present invention were solubilized in DMSO and a series of 10, three-fold serial dilutions were made for each compound in 1...
Ligand InfoPC cidPC sid
In DepthDetails US Patent