BDBM369597 US10233152, Example 108
SMILES C(CN1CCC(CC1)N[C@@H]1C[C@H]1c1ccccc1)Oc1ccnc2ccccc12
InChI Key InChIKey=IMBQRCUYSOIGOA-LADGPHEKSA-N
Data  1 IC50
  Tab Delimited (TSV)   2D SDfile   Computed 3D by Vconf -m prep SDfile
Find this compound or compounds like it in BindingDB:
Activity Spreadsheet -- Enzyme Inhibition Constant Data from BindingDB
Found 1 hit for monomerid = 369597
TargetLysine-specific histone demethylase 1A(Homo sapiens (Human))
Mirati Therapeutics
US Patent
LigandPNGBDBM369597(US10233152, Example 108)
Affinity DataIC50:  11nM. Assay description: Briefly, compounds of the present invention were solubilized in DMSO and a series of 10, three-fold serial dilutions were made for each compound in 1...
Ligand InfoPC cidPC sid
In DepthDetails US Patent