BDBM369605 US10233152, Example 113
SMILES Fc1cccc(OCCN2CCC(CC2)N[C@@H]2C[C@H]2c2ccccc2)c1
InChI Key InChIKey=OBFRWIBANRMKNL-FCHUYYIVSA-N
Data  1 IC50
  Tab Delimited (TSV)   2D SDfile   Computed 3D by Vconf -m prep SDfile
Find this compound or compounds like it in BindingDB:
Activity Spreadsheet -- Enzyme Inhibition Constant Data from BindingDB
Found 1 hit for monomerid = 369605
TargetLysine-specific histone demethylase 1A(Homo sapiens (Human))
Mirati Therapeutics
US Patent
LigandPNGBDBM369605(US10233152, Example 113)
Affinity DataIC50:  9nM. Assay description: Briefly, compounds of the present invention were solubilized in DMSO and a series of 10, three-fold serial dilutions were made for each compound in 1...
Ligand InfoPC cidPC sid
In DepthDetails US Patent