BDBM369637 US10233152, Example 144
SMILES O=C(CCN1CCC(CC1)N[C@@H]1C[C@H]1c1ccccc1)N1CCNCC1
InChI Key InChIKey=FXNQVFLYZFLKFS-VQTJNVASSA-N
Data  1 IC50
  Tab Delimited (TSV)   2D SDfile   Computed 3D by Vconf -m prep SDfile
Find this compound or compounds like it in BindingDB:
Activity Spreadsheet -- Enzyme Inhibition Constant Data from BindingDB
Found 1 hit for monomerid = 369637
TargetLysine-specific histone demethylase 1A(Homo sapiens (Human))
Mirati Therapeutics
US Patent
LigandPNGBDBM369637(US10233152, Example 144)
Affinity DataIC50:  9nM. Assay description: Briefly, compounds of the present invention were solubilized in DMSO and a series of 10, three-fold serial dilutions were made for each compound in 1...
Ligand InfoPC cidPC sid
In DepthDetails US Patent