BDBM369656 US10233156, Example I-195
SMILES C[C@@H](CO[C@H]1CC[C@@H](CC1)Oc1nc2c(F)cc(OCC3(F)COC3)c(F)c2n1C)NC(C)=O
InChI Key InChIKey=YZIRWSMKGKYJFZ-BPUTZDHNSA-N
Data  1 IC50
  Tab Delimited (TSV)   2D SDfile   Computed 3D by Vconf -m prep SDfile
Find this compound or compounds like it in BindingDB:
Activity Spreadsheet -- Enzyme Inhibition Constant Data from BindingDB
Found 1 hit for monomerid = 369656
TargetAcetyl-CoA carboxylase 2(Homo sapiens (Human))
Shionogi
US Patent
LigandPNGBDBM369656(US10233156, Example I-195)
Affinity DataIC50:  35nM. Assay description: Recombinant human ACC1 and recombinant human ACC2, which were prepared by the method mentioned above, were preincubated with assay buffer solution (5...
Ligand InfoPC cidPC sid
In DepthDetails US Patent