BDBM369693 US10233156, Example I-233
SMILES Cn1c(O[C@H]2CC[C@@H](CC2)OC[C@H](CF)NC(=O)C2CC2)nc2c(F)cc(OCC(F)F)c(F)c12
InChI Key InChIKey=APNKJQGHCBDHTJ-KKUMJFAQSA-N
Data  1 IC50
  Tab Delimited (TSV)   2D SDfile   Computed 3D by Vconf -m prep SDfile
Find this compound or compounds like it in BindingDB:
Activity Spreadsheet -- Enzyme Inhibition Constant Data from BindingDB
Found 1 hit for monomerid = 369693
TargetAcetyl-CoA carboxylase 2(Homo sapiens (Human))
Shionogi
US Patent
LigandPNGBDBM369693(US10233156, Example I-233)
Affinity DataIC50:  31nM. Assay description: Recombinant human ACC1 and recombinant human ACC2, which were prepared by the method mentioned above, were preincubated with assay buffer solution (5...
Ligand InfoPC cidPC sid
In DepthDetails US Patent