BDBM369716 US10233160, Compound 6::US9981925, Compound 6
SMILES NC(=O)c1cccc2c(NCc3ccccc3)nnnc12
InChI Key InChIKey=UDUAZEMRHDWODF-UHFFFAOYSA-N
Data  5 IC50
  Tab Delimited (TSV)   2D SDfile   Computed 3D by Vconf -m prep SDfile
Find this compound or compounds like it in BindingDB:
Activity Spreadsheet -- Enzyme Inhibition Constant Data from BindingDB
Found 5 hits for monomerid = 369716
TargetRibosomal protein S6 kinase beta-1(Homo sapiens (Human))
Merck Patent
US Patent
LigandPNGBDBM369716(US10233160, Compound 6 | US9981925, Compound 6)
Affinity DataIC50:  750nM. Assay description: p70S6K inhibitor compounds were diluted and plated in 96 well plates. A reaction mixture including the following components were then added to the co...
Ligand InfoPC cidPC sid
In DepthDetails US Patent
TargetRAC-alpha serine/threonine-protein kinase(Homo sapiens (Human))
Merck Patent
US Patent
LigandPNGBDBM369716(US10233160, Compound 6 | US9981925, Compound 6)
Affinity DataIC50: >1.00E+3nM. Assay description: In order to measure AKT inhibition in the Caliper Life Sciences LC3000, a TTP Mosquito liquid handling instrument was used to place 125 nl of the app...
Ligand InfoPC cidPC sid
In DepthDetails US Patent
TargetRibosomal protein S6 kinase beta-1(Homo sapiens (Human))
Merck Patent
US Patent
LigandPNGBDBM369716(US10233160, Compound 6 | US9981925, Compound 6)
Affinity DataIC50:  501nM. Assay description: Inhibition of N-terminal 6His-tagged human recombinant p70S6K T412E mutant (1 to 421 residues) in Sf21 insect cells using FITC-AHA-AKRRRLSSLRA-OH sub...
Ligand InfoPC cidPC sid
In DepthDetails ArticlePubMed
TargetRAC-alpha serine/threonine-protein kinase(Homo sapiens (Human))
Merck Patent
US Patent
LigandPNGBDBM369716(US10233160, Compound 6 | US9981925, Compound 6)
Affinity DataIC50: >1.00E+3nM. Assay description: In order to measure AKT inhibition in the Caliper Life Sciences LC3000, a TTP Mosquito liquid handling instrument was used to place 125 nl of the app...
Ligand InfoPC cidPC sid
In DepthDetails US Patent
TargetRibosomal protein S6 kinase beta-1(Homo sapiens (Human))
Merck Patent
US Patent
LigandPNGBDBM369716(US10233160, Compound 6 | US9981925, Compound 6)
Affinity DataIC50:  750nM. Assay description: p70S6K inhibitor compounds were diluted and plated in 96 well plates. A reaction mixture including the following components were then added to the co...
Ligand InfoPC cidPC sid
In DepthDetails US Patent