BDBM369732 US10233160, Compound 22::US9981925, Compound 22
SMILES NC(=O)c1cccc2c(NC3CNCCC3c3ccc(cc3)C(F)(F)F)nnnc12
InChI Key InChIKey=ZONZNYXZHDNBLS-UHFFFAOYSA-N
Data  4 IC50
  Tab Delimited (TSV)   2D SDfile   Computed 3D by Vconf -m prep SDfile
Find this compound or compounds like it in BindingDB:
Activity Spreadsheet -- Enzyme Inhibition Constant Data from BindingDB
Found 4 hits for monomerid = 369732
TargetRibosomal protein S6 kinase beta-1(Homo sapiens (Human))
Merck Patent
US Patent
LigandPNGBDBM369732(US10233160, Compound 22 | US9981925, Compound 22)
Affinity DataIC50: <25nM. Assay description: p70S6K inhibitor compounds were diluted and plated in 96 well plates. A reaction mixture including the following components were then added to the co...
Ligand InfoPC cidPC sid
In DepthDetails US Patent
TargetRAC-alpha serine/threonine-protein kinase(Homo sapiens (Human))
Merck Patent
US Patent
LigandPNGBDBM369732(US10233160, Compound 22 | US9981925, Compound 22)
Affinity DataIC50:  300nM. Assay description: In order to measure AKT inhibition in the Caliper Life Sciences LC3000, a TTP Mosquito liquid handling instrument was used to place 125 nl of the app...
Ligand InfoPC cidPC sid
In DepthDetails US Patent
TargetRibosomal protein S6 kinase beta-1(Homo sapiens (Human))
Merck Patent
US Patent
LigandPNGBDBM369732(US10233160, Compound 22 | US9981925, Compound 22)
Affinity DataIC50: <25nM. Assay description: p70S6K inhibitor compounds were diluted and plated in 96 well plates. A reaction mixture including the following components were then added to the co...
Ligand InfoPC cidPC sid
In DepthDetails US Patent
TargetRAC-alpha serine/threonine-protein kinase(Homo sapiens (Human))
Merck Patent
US Patent
LigandPNGBDBM369732(US10233160, Compound 22 | US9981925, Compound 22)
Affinity DataIC50:  300nM. Assay description: In order to measure AKT inhibition in the Caliper Life Sciences LC3000, a TTP Mosquito liquid handling instrument was used to place 125 nl of the app...
Ligand InfoPC cidPC sid
In DepthDetails US Patent