BDBM369738 US10233160, Compound 29::US9981925, Compound 29
SMILES CCNC[C@@H](Nc1ncnc2c(ccnc12)C(N)=O)c1ccc(c(F)c1)C(F)(F)F
InChI Key InChIKey=WWUPBSXHJAVSHJ-CQSZACIVSA-N
Data  4 IC50
  Tab Delimited (TSV)   2D SDfile   Computed 3D by Vconf -m prep SDfile
Find this compound or compounds like it in BindingDB:
Activity Spreadsheet -- Enzyme Inhibition Constant Data from BindingDB
Found 4 hits for monomerid = 369738
TargetRibosomal protein S6 kinase beta-1(Homo sapiens (Human))
Merck Patent
US Patent
LigandPNGBDBM369738(US10233160, Compound 29 | US9981925, Compound 29)
Affinity DataIC50: <25nM. Assay description: p70S6K inhibitor compounds were diluted and plated in 96 well plates. A reaction mixture including the following components were then added to the co...
Ligand InfoPC cidPC sid
In DepthDetails US Patent
TargetRAC-alpha serine/threonine-protein kinase(Homo sapiens (Human))
Merck Patent
US Patent
LigandPNGBDBM369738(US10233160, Compound 29 | US9981925, Compound 29)
Affinity DataIC50:  62.5nM. Assay description: In order to measure AKT inhibition in the Caliper Life Sciences LC3000, a TTP Mosquito liquid handling instrument was used to place 125 nl of the app...
Ligand InfoPC cidPC sid
In DepthDetails US Patent
TargetRibosomal protein S6 kinase beta-1(Homo sapiens (Human))
Merck Patent
US Patent
LigandPNGBDBM369738(US10233160, Compound 29 | US9981925, Compound 29)
Affinity DataIC50: <25nM. Assay description: p70S6K inhibitor compounds were diluted and plated in 96 well plates. A reaction mixture including the following components were then added to the co...
Ligand InfoPC cidPC sid
In DepthDetails US Patent
TargetRAC-alpha serine/threonine-protein kinase(Homo sapiens (Human))
Merck Patent
US Patent
LigandPNGBDBM369738(US10233160, Compound 29 | US9981925, Compound 29)
Affinity DataIC50:  62nM. Assay description: In order to measure AKT inhibition in the Caliper Life Sciences LC3000, a TTP Mosquito liquid handling instrument was used to place 125 nl of the app...
Ligand InfoPC cidPC sid
In DepthDetails US Patent