BDBM369792 US10233177, Example 13
SMILES Clc1ccc(CNC(=O)Nc2cccc3[nH]c(=O)[nH]c23)c(c1)N1CCCCC1
InChI Key InChIKey=UDSQXLZVIWKXME-UHFFFAOYSA-N
Data  1 IC50
  Tab Delimited (TSV)   2D SDfile   Computed 3D by Vconf -m prep SDfile
Find this compound or compounds like it in BindingDB:
Activity Spreadsheet -- Enzyme Inhibition Constant Data from BindingDB
Found 1 hit for monomerid = 369792
TargetTransient receptor potential cation channel subfamily V member 1(Rattus norvegicus (rat))
TBA
US Patent
LigandPNGBDBM369792(US10233177, Example 13)
Affinity DataIC50:  1.80nM. Assay description: Capsaicin (0.3 μM) caused an increase in [Ca2+] in the vast majority (95%) of dorsal root ganglia neurons, which were thereby identified as TRPV...
Ligand InfoPC cidPC sid
In DepthDetails US Patent