BDBM369978 3-Ethyl-N-((2R,3S)-3-methoxy-1-(3-methyl-4-oxo-1-phenyl-1,3,8-triazaspiro[4.5]decan-8-yl)-1-oxobutan-2-yl)benzamide::US10233182, Example 135
SMILES CCc1cccc(c1)C(=O)N[C@H]([C@H](C)OC)C(=O)N1CCC2(CC1)N(CN(C)C2=O)c1ccccc1
InChI Key InChIKey=QYGDBEKYTXDNBG-GBXCKJPGSA-N
Data  1 IC50
  Tab Delimited (TSV)   2D SDfile   Computed 3D by Vconf -m prep SDfile
Find this compound or compounds like it in BindingDB:
Activity Spreadsheet -- Enzyme Inhibition Constant Data from BindingDB
Found 1 hit for monomerid = 369978
LigandPNGBDBM369978(3-Ethyl-N-((2R,3S)-3-methoxy-1-(3-methyl-4-oxo-1-p...)
Affinity DataIC50: <500nM. Assay description: The efficacy of the Examples described herein, as inhibitors of ATX are demonstrated and confirmed by pharmacological in vitro assays. The following ...
Ligand InfoPC cidPC sid
In DepthDetails US Patent