BDBM370001 (R)-4-(8-(2-(2-Fluoro-5-(trifluoromethoxy)benzamido)-3-methylbutanoyl)-3-methyl-2,4-dioxo-1,3,8-triazaspiro[4.5]decan-1-yl)benzoic Acid::US10233182, Example 167
SMILES CC(C)[C@@H](NC(=O)c1cc(OC(F)(F)F)ccc1F)C(=O)N1CCC2(CC1)N(C(=O)N(C)C2=O)c1ccc(cc1)C(O)=O
InChI Key InChIKey=VJJKTFFNAHQWJT-OAQYLSRUSA-N
Data  1 IC50
  Tab Delimited (TSV)   2D SDfile   Computed 3D by Vconf -m prep SDfile
Find this compound or compounds like it in BindingDB:
Activity Spreadsheet -- Enzyme Inhibition Constant Data from BindingDB
Found 1 hit for monomerid = 370001
LigandPNGBDBM370001((R)-4-(8-(2-(2-Fluoro-5-(trifluoromethoxy)benzamid...)
Affinity DataIC50: <500nM. Assay description: The efficacy of the Examples described herein, as inhibitors of ATX are demonstrated and confirmed by pharmacological in vitro assays. The following ...
Ligand InfoPC cidPC sid
In DepthDetails US Patent