BDBM370068 US10233187, Example 6
SMILES CC(C)OC(=O)C1=CN(CC(C)(C)c2c1[nH]nc2C(F)(F)F)C(=O)c1ccc(F)c(OCCN2CCOCC2)c1
InChI Key InChIKey=QAAZXJFEGNEAOV-UHFFFAOYSA-N
Data  1 EC50
  Tab Delimited (TSV)   2D SDfile   Computed 3D by Vconf -m prep SDfile
Find this compound or compounds like it in BindingDB:
Activity Spreadsheet -- Enzyme Inhibition Constant Data from BindingDB
Found 1 hit for monomerid = 370068
TargetBile acid receptor(Homo sapiens (Human))
Akarna Therapeutics
US Patent
LigandPNGBDBM370068(US10233187, Example 6)
Affinity DataEC50:  600nM. Assay description: Starting from 3.33 mM of compound in DMSO solution, a 10-point 3-fold serial dilution was made by diluting 5 μL of compound into 10 μL of D...
Ligand InfoPC cidPC sid
In DepthDetails US Patent