BDBM37007 2-methyl-6-phenyl-3-(1-pyrrolyl)-4-thieno[2,3-d]pyrimidinone::2-methyl-6-phenyl-3-pyrrol-1-yl-thieno[2,3-d]pyrimidin-4-one::2-methyl-6-phenyl-3-pyrrol-1-ylthieno[2,3-d]pyrimidin-4-one::MLS000054603::SMR000061384::cid_1228645
SMILES Cc1nc2sc(cc2c(=O)n1-n1cccc1)-c1ccccc1
InChI Key InChIKey=AWACOTGVJWNWGJ-UHFFFAOYSA-N
Data  5 EC50
  Tab Delimited (TSV)   2D SDfile   Computed 3D by Vconf -m prep SDfile
Find this compound or compounds like it in BindingDB:
Activity Spreadsheet -- Enzyme Inhibition Constant Data from BindingDB
Found 5 hits for monomerid = 37007
TargetSphingosine 1-phosphate receptor 1(Homo sapiens (Human))
The Scripps Research Institute Molecular Screening Center
Curated by PubChem BioAssay
LigandPNGBDBM37007(2-methyl-6-phenyl-3-(1-pyrrolyl)-4-thieno[2,3-d]py...)
Affinity DataEC50:  1.76E+4nM. Assay description: Source (MLSCN Center Name): The Scripps Research Institute Molecular Screening Center Center Affiliation: The Scripps Research Institute, TSRI Assay ...
In DepthDetails PCBioAssay
TargetSphingosine 1-phosphate receptor 1(Homo sapiens (Human))
The Scripps Research Institute Molecular Screening Center
Curated by PubChem BioAssay
LigandPNGBDBM37007(2-methyl-6-phenyl-3-(1-pyrrolyl)-4-thieno[2,3-d]py...)
Affinity DataEC50: >9.51E+4nM. Assay description: Source (MLSCN Center Name): The Scripps Research Institute Molecular Screening Center Center Affiliation: The Scripps Research Institute, TSRI Assay ...
In DepthDetails PCBioAssay
TargetIsoform 2 of Nuclear receptor ROR-alpha (Alpha-2)(Homo sapiens (Human))
The Scripps Research Institute Molecular Screening Center
Curated by PubChem BioAssay
LigandPNGBDBM37007(2-methyl-6-phenyl-3-(1-pyrrolyl)-4-thieno[2,3-d]py...)
Affinity DataEC50:  112nM. Assay description: Source (MLSCN Center Name): The Scripps Research Institute Molecular Screening Center Center Affiliation: The Scripps Research Institute, TSRI Assay ...
In DepthDetails PCBioAssay
TargetSteroidogenic factor 1(Homo sapiens (Human))
The Scripps Research Institute Molecular Screening Center
Curated by PubChem BioAssay
LigandPNGBDBM37007(2-methyl-6-phenyl-3-(1-pyrrolyl)-4-thieno[2,3-d]py...)
Affinity DataEC50:  477nM. Assay description: Source (MLSCN Center Name): The Scripps Research Institute Molecular Screening Center Center Affiliation: The Scripps Research Institute, TSRI Assay ...
In DepthDetails PCBioAssay
TargetSphingosine 1-phosphate receptor 1(Homo sapiens (Human))
The Scripps Research Institute Molecular Screening Center
Curated by PubChem BioAssay
LigandPNGBDBM37007(2-methyl-6-phenyl-3-(1-pyrrolyl)-4-thieno[2,3-d]py...)
Affinity DataEC50:  2.22E+4nM. Assay description: Source (MLSCN Center Name): The Scripps Research Institute Molecular Screening Center Center Affiliation: The Scripps Research Institute, TSRI Assay ...
In DepthDetails PCBioAssay