BDBM370092 US10233187, Example 30
SMILES CCCCc1n[nH]c2c1C(C)(C)CN(C=C2C(=O)OC(C)C)C(=O)C1CCCCC1
InChI Key InChIKey=QQKIXVHMRPEARJ-UHFFFAOYSA-N
Data  1 EC50
  Tab Delimited (TSV)   2D SDfile   Computed 3D by Vconf -m prep SDfile
Find this compound or compounds like it in BindingDB:
Activity Spreadsheet -- Enzyme Inhibition Constant Data from BindingDB
Found 1 hit for monomerid = 370092
TargetBile acid receptor(Homo sapiens (Human))
Akarna Therapeutics
US Patent
LigandPNGBDBM370092(US10233187, Example 30)
Affinity DataEC50:  600nM. Assay description: Starting from 3.33 mM of compound in DMSO solution, a 10-point 3-fold serial dilution was made by diluting 5 μL of compound into 10 μL of D...
Ligand InfoPC cidPC sid
In DepthDetails US Patent