BDBM370107 US10233187, Example 45
SMILES CC(C)NC(=O)C1=CN(CC(C)(C)c2cn[nH]c12)C(=O)c1ccc(F)c(F)c1
InChI Key InChIKey=ZCPBJHAKFBKCKE-UHFFFAOYSA-N
Data  1 EC50
  Tab Delimited (TSV)   2D SDfile   Computed 3D by Vconf -m prep SDfile
Find this compound or compounds like it in BindingDB:
Activity Spreadsheet -- Enzyme Inhibition Constant Data from BindingDB
Found 1 hit for monomerid = 370107
TargetBile acid receptor(Homo sapiens (Human))
Akarna Therapeutics
US Patent
LigandPNGBDBM370107(US10233187, Example 45)
Affinity DataEC50:  600nM. Assay description: Starting from 3.33 mM of compound in DMSO solution, a 10-point 3-fold serial dilution was made by diluting 5 μL of compound into 10 μL of D...
Ligand InfoPC cidPC sid
In DepthDetails US Patent