BDBM37019 1-(2,5-dimethylphenyl)-5-(1-phenyltetrazol-5-yl)sulfanyltetrazole::1-(2,5-dimethylphenyl)-5-[(1-phenyl-1,2,3,4-tetrazol-5-yl)sulfanyl]-1,2,3,4-tetrazole::1-(2,5-dimethylphenyl)-5-[(1-phenyl-5-tetrazolyl)thio]tetrazole::1-(2,5-dimethylphenyl)-5-[(1-phenyltetrazol-5-yl)thio]tetrazole::MLS000058486::SMR000068073::cid_2649844
SMILES Cc1ccc(C)c(c1)-n1nnnc1Sc1nnnn1-c1ccccc1
InChI Key InChIKey=LFCRESUTNYKKSG-UHFFFAOYSA-N
Data  2 IC50  3 EC50
  Tab Delimited (TSV)   2D SDfile   Computed 3D by Vconf -m prep SDfile
Find this compound or compounds like it in BindingDB:
Activity Spreadsheet -- Enzyme Inhibition Constant Data from BindingDB
Found 5 hits for monomerid = 37019
TargetSphingosine 1-phosphate receptor 1(Homo sapiens (Human))
The Scripps Research Institute Molecular Screening Center
Curated by PubChem BioAssay
LigandPNGBDBM37019(1-(2,5-dimethylphenyl)-5-(1-phenyltetrazol-5-yl)su...)
Affinity DataEC50:  1.48E+4nM. Assay description: Source (MLSCN Center Name): The Scripps Research Institute Molecular Screening Center Center Affiliation: The Scripps Research Institute, TSRI Assay ...
In DepthDetails PCBioAssay
TargetSphingosine 1-phosphate receptor 1(Homo sapiens (Human))
The Scripps Research Institute Molecular Screening Center
Curated by PubChem BioAssay
LigandPNGBDBM37019(1-(2,5-dimethylphenyl)-5-(1-phenyltetrazol-5-yl)su...)
Affinity DataEC50:  6.91E+3nM. Assay description: Source (MLSCN Center Name): The Scripps Research Institute Molecular Screening Center Center Affiliation: The Scripps Research Institute, TSRI Assay ...
In DepthDetails PCBioAssay
TargetHexokinase HKDC1 [W721R](Homo sapiens (Human))
Burnham Center For Chemical Genomics
Curated by PubChem BioAssay
LigandPNGBDBM37019(1-(2,5-dimethylphenyl)-5-(1-phenyltetrazol-5-yl)su...)
Affinity DataIC50:  8.00E+4nM. Assay description: Data Source: Sanford-Burnham Center for Chemical Genomics (SBCCG) Source Affiliation: Sanford-Burnham Medical Research Institute (SBMRI, San Diego, C...
In DepthDetails PCBioAssay
TargetHexokinase HKDC1 [W721R](Homo sapiens (Human))
Burnham Center For Chemical Genomics
Curated by PubChem BioAssay
LigandPNGBDBM37019(1-(2,5-dimethylphenyl)-5-(1-phenyltetrazol-5-yl)su...)
Affinity DataIC50:  2.26E+4nM. Assay description: Data Source: Sanford-Burnham Center for Chemical Genomics (SBCCG) Source Affiliation: Sanford-Burnham Medical Research Institute (SBMRI, San Diego, C...
In DepthDetails PCBioAssay
TargetSphingosine 1-phosphate receptor 1(Homo sapiens (Human))
The Scripps Research Institute Molecular Screening Center
Curated by PubChem BioAssay
LigandPNGBDBM37019(1-(2,5-dimethylphenyl)-5-(1-phenyltetrazol-5-yl)su...)
Affinity DataEC50:  1.28E+4nM. Assay description: Source (MLSCN Center Name): The Scripps Research Institute Molecular Screening Center Center Affiliation: The Scripps Research Institute, TSRI Assay ...
In DepthDetails PCBioAssay